Target
Nuclear factor erythroid 2-related factor 2
Ligand
BDBM50537619
Substrate
Meas. Tech.
ChEMBL_1970282 (CHEMBL4603100)
IC50
130±n/a nM
Citation
 Lazzara, PRDavid, BPAnkireddy, ARichardson, BGDye, KRatia, KMReddy, SPMoore, TW Isoquinoline Kelch-like ECH-Associated Protein 1-Nuclear Factor (Erythroid-Derived 2)-like 2 (KEAP1-NRF2) Inhibitors with High Metabolic Stability. J Med Chem 63:6547-6560 (2020)  
Target
Name:
Nuclear factor erythroid 2-related factor 2
Synonyms:
HEBP1 NF-E2-related factor 2 NFE2-related factor 2 NRF2 Nuclear factor, erythroid derived 2, like 2
Type:
PROTEIN
Mol. Mass.:
67786.89
Organism:
Homo sapiens (Human)
Description:
ChEMBL_107924
Residue:
605
  
Inhibitor
Name:
BDBM50537619
Synonyms:
CHEMBL4648321
Type:
Small organic molecule
Emp. Form.:
C26H21F4N3O7S2
Mol. Mass.:
627.584
SMILES:
COc1ccc(cc1)S(=O)(=O)N(CC(F)(F)F)c1cnc(N(CC(O)=O)S(=O)(=O)c2ccc(F)cc2)c2ccccc12
: