Target
Maltase-glucoamylase
Ligand
BDBM50031480
Substrate
Meas. Tech.
ChEMBL_101864 (CHEMBL710107)
IC50
500000±n/a nM
Citation
 Asano, NKizu, HOseki, KTomioka, EMatsui, KOkamoto, MBaba, M N-alkylated nitrogen-in-the-ring sugars: conformational basis of inhibition of glycosidases and HIV-1 replication. J Med Chem 38:2349-56 (1995)  
Target
Name:
Maltase-glucoamylase
Synonyms:
Alpha glucosidase Glucan 1,4-alpha-glucosidase MGAM MGA_HUMAN Maltase-glucoamylase, intestinal | Synonyms=MGA
Type:
Enzyme
Mol. Mass.:
209817.06
Organism:
Homo sapiens (Human)
Description:
O43451
Residue:
2753
  
Inhibitor
Name:
BDBM50031480
Synonyms:
(2R,3R,4R)-2-Hydroxymethyl-1-methyl-pyrrolidine-3,4-diol | CHEMBL80148
Type:
Small organic molecule
Emp. Form.:
C6H13NO3
Mol. Mass.:
147.1723
SMILES:
CN1C[C@@H](O)[C@H](O)[C@H]1CO
: