Target
Sucrase-isomaltase, intestinal
Ligand
BDBM18353
Substrate
Meas. Tech.
ChEMBL_206287 (CHEMBL808824)
IC50
40±n/a nM
Citation
 Asano, NKizu, HOseki, KTomioka, EMatsui, KOkamoto, MBaba, M N-alkylated nitrogen-in-the-ring sugars: conformational basis of inhibition of glycosidases and HIV-1 replication. J Med Chem 38:2349-56 (1995)  
Target
Name:
Sucrase-isomaltase, intestinal
Synonyms:
SUIS_RAT Sucrase-isomaltase | alpha-Glucosidase (α-Glucosidase)
Type:
Enzyme
Mol. Mass.:
210329.04
Organism:
Rattus norvegicus (Rat)
Description:
P23739
Residue:
1841
  
Inhibitor
Name:
BDBM18353
Synonyms:
(2R,3R,4R,5S)-2-(hydroxymethyl)-1-methylpiperidine-3,4,5-triol N-Methyl-DNJ | US9181184, 2
Type:
natural product
Emp. Form.:
C7H15NO4
Mol. Mass.:
177.1983
SMILES:
CN1C[C@H](O)[C@@H](O)[C@H](O)[C@H]1CO
: