Target
Alpha-mannosidase 2C1
Ligand
BDBM18355
Substrate
Meas. Tech.
ChEMBL_32499 (CHEMBL641376)
IC50
<50000±n/a nM
Citation
 Asano, NKizu, HOseki, KTomioka, EMatsui, KOkamoto, MBaba, M N-alkylated nitrogen-in-the-ring sugars: conformational basis of inhibition of glycosidases and HIV-1 replication. J Med Chem 38:2349-56 (1995)  
Target
Name:
Alpha-mannosidase 2C1
Synonyms:
MA2C1_RAT | Man2c1
Type:
PROTEIN
Mol. Mass.:
115965.84
Organism:
Rattus norvegicus
Description:
ChEMBL_32499
Residue:
1040
  
Inhibitor
Name:
BDBM18355
Synonyms:
(2R,3R,4R,5S)-1-butyl-2-(hydroxymethyl)piperidine-3,4,5-triol MIGLUSTAT US20230339856, Compound NB-DNJ | US9181184, 5
Type:
Small organic molecule
Emp. Form.:
C10H21NO4
Mol. Mass.:
219.278
SMILES:
CCCCN1C[C@H](O)[C@@H](O)[C@H](O)[C@H]1CO
: