Target
Alpha-mannosidase 2C1
Ligand
BDBM50016703
Substrate
Meas. Tech.
ChEMBL_32499 (CHEMBL641376)
IC50
<50000±n/a nM
Citation
 Asano, NKizu, HOseki, KTomioka, EMatsui, KOkamoto, MBaba, M N-alkylated nitrogen-in-the-ring sugars: conformational basis of inhibition of glycosidases and HIV-1 replication. J Med Chem 38:2349-56 (1995)  
Target
Name:
Alpha-mannosidase 2C1
Synonyms:
MA2C1_RAT | Man2c1
Type:
PROTEIN
Mol. Mass.:
115965.84
Organism:
Rattus norvegicus
Description:
ChEMBL_32499
Residue:
1040
  
Inhibitor
Name:
BDBM50016703
Synonyms:
2-Hydroxymethyl-pyrrolidine-3,4-diol CHEMBL80254 | Imino-D-Arabinitol
Type:
Small organic molecule
Emp. Form.:
C5H11NO3
Mol. Mass.:
133.1457
SMILES:
OC[C@H]1NC[C@@H](O)[C@@H]1O
: