Target
Gamma-aminobutyric acid type B receptor subunit 1/2
Ligand
BDBM24182
Substrate
Meas. Tech.
ChEMBL_68568 (CHEMBL679655)
IC50
107±n/a nM
Citation
 Froestl, WMickel, SJHall, RGvon Sprecher, GStrub, DBaumann, PABrugger, FGentsch, CJaekel, JOlpe, HR Phosphinic acid analogues of GABA. 1. New potent and selective GABAB agonists. J Med Chem 38:3297-312 (1995)  
Target
Name:
Gamma-aminobutyric acid type B receptor subunit 1/2
Synonyms:
GABA B receptor | GABA-B receptor 1/2
Type:
Mol. Mass.:
Description:
ASSAY_ID of EBI is 68556
Components:
This complex has 2 components.
Component 1
Name:
Gamma-aminobutyric acid type B receptor subunit 1
Synonyms:
GABA B GABA uptake GABA-B-R1 GABABR1 Gabbr1 | Gb1
Type:
Enzyme Catalytic Domain
Mol. Mass.:
111548.69
Organism:
Rattus norvegicus (Rat)
Description:
Q9Z0U4
Residue:
991
  
Component 2
Name:
Gamma-aminobutyric acid type B receptor subunit 2
Synonyms:
GABA B receptor Gabbr2 | Gpr51
Type:
PROTEIN
Mol. Mass.:
105775.46
Organism:
Rattus norvegicus
Description:
O88871
Residue:
940
  
Inhibitor
Name:
BDBM24182
Synonyms:
4-amino-3-(4-chlorophenyl)butanoic acid Baclophen Gabalon | Lioresal
Type:
Small organic molecule
Emp. Form.:
C10H12ClNO2
Mol. Mass.:
213.661
SMILES:
NCC(CC(O)=O)c1ccc(Cl)cc1
: