Target
Alpha-1D adrenergic receptor
Ligand
BDBM50013515
Substrate
Meas. Tech.
ChEMBL_32457 (CHEMBL643573)
Ki
1.6±n/a nM
Citation
 Hieble, JPBondinell, WERuffolo, RR Alpha- and beta-adrenoceptors: from the gene to the clinic. 1. Molecular biology and adrenoceptor subclassification. J Med Chem 38:3415-44 (1995)  
Target
Name:
Alpha-1D adrenergic receptor
Synonyms:
ADA1D_HUMAN ADRA1D Adrenergic receptor alpha Alpha 1D-adrenoreceptor Alpha-1D adrenoceptor adrenergic Alpha1D
Type:
Enzyme Catalytic Domain
Mol. Mass.:
60485.82
Organism:
Homo sapiens (Human)
Description:
adrenergic Alpha1D ADRA1D HUMAN::P25100
Residue:
572
  
Inhibitor
Name:
BDBM50013515
Synonyms:
(+)-yohimbine 17alpha-hydroxyyohimban-16alpha-carboxylic acid methyl ester CORYNANTHINE Quebrachin YOHIMBINE CHLORIDE Yohimbine cid_8969 methyl 17alpha-hydroxyyohimban-16alpha-carboxylate yohimbic acid methyl ester
Type:
Small organic molecule
Emp. Form.:
C21H26N2O3
Mol. Mass.:
354.4427
SMILES:
COC(=O)[C@H]1[C@@H](O)CC[C@H]2CN3CCc4c([nH]c5ccccc45)[C@@H]3C[C@H]12
: