Target
Alpha-1B adrenergic receptor
Ligand
BDBM86731
Substrate
Meas. Tech.
ChEMBL_34465 (CHEMBL651997)
Ki
0.74±n/a nM
Citation
 Hieble, JPBondinell, WERuffolo, RR Alpha- and beta-adrenoceptors: from the gene to the clinic. 1. Molecular biology and adrenoceptor subclassification. J Med Chem 38:3415-44 (1995)  
Target
Name:
Alpha-1B adrenergic receptor
Synonyms:
ADA1B_HUMAN Adrenergic alpha1B Adrenergic receptor alpha Alpha 1B-adrenoreceptor | Alpha-1B adrenergic receptor
Type:
Enzyme
Mol. Mass.:
56862.13
Organism:
Homo sapiens (Human)
Description:
P35368
Residue:
520
  
Inhibitor
Name:
BDBM86731
Synonyms:
CAS_74191-85-8 UK 33,274
Type:
Small organic molecule
Emp. Form.:
C23H25N5O5
Mol. Mass.:
451.4751
SMILES:
COc1cc2nc(nc(N)c2cc1OC)N1CCN(CC1)C(=O)C1COc2ccccc2O1
: