Target
Coagulation factor X
Ligand
BDBM50034585
Substrate
Meas. Tech.
ChEMBL_48663 (CHEMBL657715)
Ki
1.2±n/a nM
Citation
 Deadman, JJElgendy, SGoodwin, CAGreen, DBaban, JAPatel, GSkordalakes, EChino, NClaeson, GKakkar, VV Characterization of a class of peptide boronates with neutral P1 side chains as highly selective inhibitors of thrombin. J Med Chem 38:1511-22 (1995)  
Target
Name:
Coagulation factor X
Synonyms:
Activated coagulation factor X (FXa) Coagulation factor X precursor F10 Factor X heavy chain Factor Xa Stuart-Prower factor
Type:
Enzyme
Mol. Mass.:
54726.60
Organism:
Homo sapiens (Human)
Description:
Residue:
488
  
Inhibitor
Name:
BDBM50034585
Synonyms:
CHEMBL285285 | Peptide boronate
Type:
Small organic molecule
Emp. Form.:
C40H48BN3O6
Mol. Mass.:
677.637
SMILES:
CC1(C)C2CC1[C@]1(C)OB(O[C@@H]1C2)C(Cc1ccccc1)NC(=O)[C@@H]1CCCN1C(=O)[C@H](Cc1ccccc1)NC(=O)OCc1ccccc1
: