Target
Neutrophil elastase
Ligand
BDBM50036053
Substrate
Meas. Tech.
ChEMBL_63989 (CHEMBL673099)
Ki
16000±n/a nM
Citation
 Edwards, PDWolanin, DJAndisik, DWDavis, MW Peptidyl alpha-ketoheterocyclic inhibitors of human neutrophil elastase. 2. Effect of varying the heterocyclic ring on in vitro potency. J Med Chem 38:76-85 (1995)  
Target
Name:
Neutrophil elastase
Synonyms:
Bone marrow serine protease Coagulation factor X ELANE Elastase HLE Leukocyte elastase Medullasin Neutrophil elastase (HNE) PMN elastase Trypsin
Type:
Enzyme
Mol. Mass.:
28532.38
Organism:
Homo sapiens (Human)
Description:
P08246
Residue:
267
  
Inhibitor
Name:
BDBM50036053
Synonyms:
CHEMBL355765 | {(S)-1-[(S)-2-((S)-1-Benzoyl-2-methyl-propylcarbamoyl)-pyrrolidine-1-carbonyl]-2-methyl-propyl}-carbamic acid benzyl ester
Type:
Small organic molecule
Emp. Form.:
C29H37N3O5
Mol. Mass.:
507.6212
SMILES:
CC(C)[C@H](NC(=O)OCc1ccccc1)C(=O)N1CCC[C@H]1C(=O)N[C@@H](C(C)C)C(=O)c1ccccc1
: