Target
Cannabinoid receptor 2
Ligand
BDBM50491561
Substrate
Meas. Tech.
ChEMBL_959206 (CHEMBL2383561)
Ki
0.840000±n/a nM
Citation
 Aghazadeh Tabrizi, MBaraldi, PGSaponaro, GMoorman, ARRomagnoli, RPreti, DBaraldi, SRuggiero, ETintori, CTuccinardi, TVincenzi, FBorea, PAVarani, K Discovery of 7-oxopyrazolo[1,5-a]pyrimidine-6-carboxamides as potent and selective CB(2) cannabinoid receptor inverse agonists. J Med Chem 56:4482-96 (2013)  
Target
Name:
Cannabinoid receptor 2
Synonyms:
CANNABINOID CB2 CB2 CB2B CNR2_HUMAN Cannabinoid CB2 receptor Cannabinoid receptor 2 (CB2R) | hCB2
Type:
G Protein-Coupled Receptor (GPCR)
Mol. Mass.:
39690.94
Organism:
Homo sapiens (Human)
Description:
P34972
Residue:
360
  
Inhibitor
Name:
BDBM50491561
Synonyms:
CHEMBL2381809
Type:
Small organic molecule
Emp. Form.:
C24H34N4O2
Mol. Mass.:
410.5524
SMILES:
CCCCCn1cc(C(=O)NC23CC4CC(CC(C4)C2)C3)c(=O)n2nc(CC)cc12
: