Target
Leukotriene B4 receptor 1
Ligand
BDBM50037389
Substrate
Meas. Tech.
ChEMBL_99829 (CHEMBL709859)
Ki
5.7±n/a nM
Citation
 Daines, RAChambers, PAEggleston, DSFoley, JJGriswold, DEHaltiwanger, RCJakas, DRKingsbury, WDMartin, LDPendrak, I (E)-3-[[[[6-(2-carboxyethenyl)-5-[[8-(4- methoxyphenyl)octyl]oxy]-2-pyridinyl]-methyl]thio]methyl]benzoic acid and related compounds: high affinity leukotriene B4 receptor antagonists. J Med Chem 37:3327-36 (1994)  
Target
Name:
Leukotriene B4 receptor 1
Synonyms:
BLT BLTR Chemoattractant receptor-like 1 GPR16 LTB4-R 1 Leukotriene B4 R1 Leukotriene B4 receptor 1 P2Y purinoceptor 7 | P2Y7
Type:
Enzyme Catalytic Domain
Mol. Mass.:
37582.68
Organism:
Homo sapiens (Human)
Description:
Q15722
Residue:
352
  
Inhibitor
Name:
BDBM50037389
Synonyms:
4-{6-((E)-2-Carboxy-vinyl)-5-[8-(4-methoxy-phenyl)-octyloxy]-pyridin-2-ylmethylsulfanylmethyl}-benzoic acid | CHEMBL325637
Type:
Small organic molecule
Emp. Form.:
C32H37NO6S
Mol. Mass.:
563.704
SMILES:
COc1ccc(CCCCCCCCOc2ccc(CSCc3ccc(cc3)C(O)=O)nc2\C=C\C(O)=O)cc1
: