Target
Mu-type opioid receptor
Ligand
BDBM60212
Substrate
Meas. Tech.
ChEMBL_980537 (CHEMBL2422696)
EC50
0.160000±n/a nM
Citation
 Yuan, YElbegdorj, OBeletskaya, IOSelley, DEZhang, Y Structure activity relationship studies of 17-cyclopropylmethyl-3,14?-dihydroxy-4,5?-epoxy-6?-(isoquinoline-3'-carboxamido)morphinan (NAQ) analogues as potent opioid receptor ligands: preliminary results on the role of electronic characteristics for affinity and function. Bioorg Med Chem Lett 23:5045-8 (2013)  
Target
Name:
Mu-type opioid receptor
Synonyms:
M-OR-1 Mor OPRM_MOUSE Oprm | Oprm1
Type:
Enzyme Catalytic Domain
Mol. Mass.:
44431.62
Organism:
MOUSE
Description:
OPIATE Mu OPRM1 MOUSE::P42866
Residue:
398
  
Inhibitor
Name:
BDBM60212
Synonyms:
(4R,4aS,7aR,12bS)-3-(cyclopropylmethyl)-4a,9-bis(oxidanyl)-2,4,5,6,7a,13-hexahydro-1H-4,12-methanobenzofuro[3,2-e]isoquinoline-7-one;hydrochloride MLS000069607 SMR000058767 US9107954, naltrexone | cid_5485201
Type:
Small organic molecule
Emp. Form.:
C20H23NO4
Mol. Mass.:
341.4009
SMILES:
Oc1ccc2C[C@H]3N(CC4CC4)CC[C@@]45[C@@H](Oc1c24)C(=O)CC[C@@]35O
: