Target
Adenosine receptor A1
Ligand
BDBM50493151
Substrate
Meas. Tech.
ChEMBL_980554 (CHEMBL2422900)
Ki
0.000740±n/a nM
Citation
 Mishra, CBSharma, DPrakash, AKumari, NKumar, NLuthra, PM Design and synthesis of (4E)-4-(4-substitutedbenzylideneamino)-3-substituted-2,3-dihydro-2-thioxothiazole-5-carbonitrile as novel A2A receptor antagonists. Bioorg Med Chem 21:6077-83 (2013)  
Target
Name:
Adenosine receptor A1
Synonyms:
A1 adenosine receptor (hA1) AA1R_HUMAN ADORA1 Adenosine A1-receptor Adenosine receptor A1 (hA1) | Adenosine transporter (AdT)
Type:
G Protein-Coupled Receptor (GPCR)
Mol. Mass.:
36520.92
Organism:
Homo sapiens (Human)
Description:
P30542
Residue:
326
  
Inhibitor
Name:
BDBM50493151
Synonyms:
CHEMBL2419139
Type:
Small organic molecule
Emp. Form.:
C13H10BrN3S2
Mol. Mass.:
352.273
SMILES:
CCn1c(\N=C\c2ccc(Br)cc2)c(sc1=S)C#N
: