Target
3',5'-cyclic-AMP phosphodiesterase
Ligand
BDBM50038978
Substrate
Meas. Tech.
ChEMBL_155848 (CHEMBL766944)
IC50
>100000±n/a nM
Citation
 Takase, YSaeki, TWatanabe, NAdachi, HSouda, SSaito, I Cyclic GMP phosphodiesterase inhibitors. 2. Requirement of 6-substitution of quinazoline derivatives for potent and selective inhibitory activity. J Med Chem 37:2106-11 (1994)  
Target
Name:
3',5'-cyclic-AMP phosphodiesterase
Synonyms:
Phosphodiesterase 4A
Type:
PROTEIN
Mol. Mass.:
13615.65
Organism:
Sus scrofa
Description:
ChEMBL_155848
Residue:
118
  
Inhibitor
Name:
BDBM50038978
Synonyms:
Benzo[1,3]dioxol-5-ylmethyl-(6,7,8-trimethoxy-quinazolin-4-yl)-amine | CHEMBL302299
Type:
Small organic molecule
Emp. Form.:
C19H19N3O5
Mol. Mass.:
369.3713
SMILES:
COc1cc2c(NCc3ccc4OCOc4c3)ncnc2c(OC)c1OC
: