Target
cGMP-dependent 3',5'-cyclic phosphodiesterase
Ligand
BDBM50038973
Substrate
Meas. Tech.
ChEMBL_155838 (CHEMBL768657)
IC50
>100000±n/a nM
Citation
 Takase, YSaeki, TWatanabe, NAdachi, HSouda, SSaito, I Cyclic GMP phosphodiesterase inhibitors. 2. Requirement of 6-substitution of quinazoline derivatives for potent and selective inhibitory activity. J Med Chem 37:2106-11 (1994)  
Target
Name:
cGMP-dependent 3',5'-cyclic phosphodiesterase
Synonyms:
CGS-PDE Homo sapiens phosphodiesterase 2A (PDE2A) PDE2A cGSPDE
Type:
Enzyme Catalytic Domain
Mol. Mass.:
105691.58
Organism:
Homo sapiens (Human)
Description:
O00408
Residue:
941
  
Inhibitor
Name:
BDBM50038973
Synonyms:
Benzo[1,3]dioxol-5-ylmethyl-(6-methyl-quinazolin-4-yl)-amine | CHEMBL67276
Type:
Small organic molecule
Emp. Form.:
C17H15N3O2
Mol. Mass.:
293.3199
SMILES:
Cc1ccc2ncnc(NCc3ccc4OCOc4c3)c2c1
: