Target
Adenosine receptor A1
Ligand
BDBM50039680
Substrate
Meas. Tech.
ChEMBL_29601 (CHEMBL640259)
Kd
0.73±n/a nM
Citation
 Scammells, PJBaker, SPBelardinelli, LOlsson, RA Substituted 1,3-dipropylxanthines as irreversible antagonists of A1 adenosine receptors. J Med Chem 37:2704-12 (1994)  
Target
Name:
Adenosine receptor A1
Synonyms:
A1 adenosine receptor (hA1) AA1R_HUMAN ADORA1 Adenosine A1-receptor Adenosine receptor A1 (hA1) | Adenosine transporter (AdT)
Type:
G Protein-Coupled Receptor (GPCR)
Mol. Mass.:
36520.92
Organism:
Homo sapiens (Human)
Description:
P30542
Residue:
326
  
Inhibitor
Name:
BDBM50039680
Synonyms:
8-(2,5-Dioxo-2,5-dihydro-pyrrol-1-ylmethyl)-1,3-dipropyl-3,7-dihydro-purine-2,6-dione | CHEMBL94234
Type:
Small organic molecule
Emp. Form.:
C16H19N5O4
Mol. Mass.:
345.3532
SMILES:
CCCn1c2nc(CN3C(=O)C=CC3=O)[nH]c2c(=O)n(CCC)c1=O
: