Target
Adenosine receptor A1
Ligand
BDBM50039692
Substrate
Meas. Tech.
ChEMBL_29595 (CHEMBL640253)
IC50
1200±n/a nM
Citation
 Scammells, PJBaker, SPBelardinelli, LOlsson, RA Substituted 1,3-dipropylxanthines as irreversible antagonists of A1 adenosine receptors. J Med Chem 37:2704-12 (1994)  
Target
Name:
Adenosine receptor A1
Synonyms:
A1 adenosine receptor (hA1) AA1R_HUMAN ADORA1 Adenosine A1-receptor Adenosine receptor A1 (hA1) | Adenosine transporter (AdT)
Type:
G Protein-Coupled Receptor (GPCR)
Mol. Mass.:
36520.92
Organism:
Homo sapiens (Human)
Description:
P30542
Residue:
326
  
Inhibitor
Name:
BDBM50039692
Synonyms:
2-Bromo-N-[5-(2,6-dioxo-1,3-dipropyl-2,3,6,7-tetrahydro-1H-purin-8-yl)-pentyl]-acetamide | CHEMBL91505
Type:
Small organic molecule
Emp. Form.:
C18H28BrN5O3
Mol. Mass.:
442.351
SMILES:
CCCn1c2nc(CCCCCNC(=O)CBr)[nH]c2c(=O)n(CCC)c1=O
: