Target
5-hydroxytryptamine receptor 1A
Ligand
BDBM50039788
Substrate
Meas. Tech.
ChEMBL_1450 (CHEMBL616574)
Ki
203±n/a nM
Citation
 Mokrosz, JLPaluchowska, MHChojnacka-Wójcik, EFilip, MCharakchieva-Minol, SDeren-Wesolek, AMokrosz, MJ Structure-activity relationship studies of central nervous system agents. 13. 4-[3-(Benzotriazol-1-yl)propyl]-1-(2-methoxyphenyl)piperazine, a new putative 5-HT1A receptor antagonist, and its analogs. J Med Chem 37:2754-60 (1994)  
Target
Name:
5-hydroxytryptamine receptor 1A
Synonyms:
5-HT-1A 5-HT1A 5-hydroxytryptamine receptor 1A (5HT1A) 5ht1a Htr1a Serotonin 1a (5-HT1a) receptor/Adrenergic receptor alpha-1 | Serotonin receptor 1A
Type:
G Protein-Coupled Receptor (GPCR)
Mol. Mass.:
46445.29
Organism:
Rattus norvegicus (rat)
Description:
Binding assays were performed using rat hippocampal membranes.
Residue:
422
  
Inhibitor
Name:
BDBM50039788
Synonyms:
1-Ethyl-4-(2-methoxy-phenyl)-piperazine | CHEMBL91689
Type:
Small organic molecule
Emp. Form.:
C13H20N2O
Mol. Mass.:
220.3107
SMILES:
CCN1CCN(CC1)c1ccccc1OC
: