Target
Calpain-1 catalytic subunit
Ligand
BDBM50039994
Substrate
Meas. Tech.
ChEMBL_43688 (CHEMBL653666)
Ki
78±n/a nM
Citation
 Harbeson, SLAbelleira, SMAkiyama, ABarrett, RCarroll, RMStraub, JATkacz, JNWu, CMusso, GF Stereospecific synthesis of peptidyl alpha-keto amides as inhibitors of calpain. J Med Chem 37:2918-29 (1994)  
Target
Name:
Calpain-1 catalytic subunit
Synonyms:
CAN1_HUMAN CAPN1 Calpain-1 (u-Calpain) Calpain1
Type:
Protein
Mol. Mass.:
81880.51
Organism:
Homo sapiens (Human)
Description:
Residue:
714
  
Inhibitor
Name:
BDBM50039994
Synonyms:
CHEMBL419898 | [(S)-1-(1-Ethylcarbamoyl-butylcarbamoyl)-3-methyl-butyl]-carbamic acid benzyl ester
Type:
Small organic molecule
Emp. Form.:
C21H33N3O4
Mol. Mass.:
391.5044
SMILES:
CCCC(NC(=O)[C@H](CC(C)C)NC(=O)OCc1ccccc1)C(=O)NCC
: