Target
Calpain-2 catalytic subunit
Ligand
BDBM50039995
Substrate
Meas. Tech.
ChEMBL_43852 (CHEMBL658513)
Ki
51±n/a nM
Citation
 Harbeson, SLAbelleira, SMAkiyama, ABarrett, RCarroll, RMStraub, JATkacz, JNWu, CMusso, GF Stereospecific synthesis of peptidyl alpha-keto amides as inhibitors of calpain. J Med Chem 37:2918-29 (1994)  
Target
Name:
Calpain-2 catalytic subunit
Synonyms:
CAN2_HUMAN CANPL2 Calcium-activated neutral proteinase 2 Calpain M-type Calpain-2 (m-Calpain) Calpain-2 large subunit M-calpain calpain
Type:
Protein
Mol. Mass.:
79965.18
Organism:
Homo sapiens (Human)
Description:
Residue:
700
  
Inhibitor
Name:
BDBM50039995
Synonyms:
CHEMBL98777 | [(S)-1-(1-Ethylcarbamoyl-2-phenyl-ethylcarbamoyl)-3-methyl-butyl]-carbamic acid benzyl ester
Type:
Small organic molecule
Emp. Form.:
C25H33N3O4
Mol. Mass.:
439.5472
SMILES:
CCNC(=O)C(Cc1ccccc1)NC(=O)[C@H](CC(C)C)NC(=O)OCc1ccccc1
: