Target
Calpain-1 catalytic subunit
Ligand
BDBM50039996
Substrate
Meas. Tech.
ChEMBL_43688 (CHEMBL653666)
Ki
119±n/a nM
Citation
 Harbeson, SLAbelleira, SMAkiyama, ABarrett, RCarroll, RMStraub, JATkacz, JNWu, CMusso, GF Stereospecific synthesis of peptidyl alpha-keto amides as inhibitors of calpain. J Med Chem 37:2918-29 (1994)  
Target
Name:
Calpain-1 catalytic subunit
Synonyms:
CAN1_HUMAN CAPN1 Calpain-1 (u-Calpain) Calpain1
Type:
Protein
Mol. Mass.:
81880.51
Organism:
Homo sapiens (Human)
Description:
Residue:
714
  
Inhibitor
Name:
BDBM50039996
Synonyms:
CHEMBL98950 | Morpholine-4-carboxylic acid [(S)-1-(3-ethylcarbamoyl-propylcarbamoyl)-3-methyl-butyl]-amide
Type:
Small organic molecule
Emp. Form.:
C17H32N4O4
Mol. Mass.:
356.4604
SMILES:
CCNC(=O)CCCNC(=O)[C@H](CC(C)C)NC(=O)N1CCOCC1
: