Target
Calpain-1 catalytic subunit
Ligand
BDBM50040006
Substrate
Meas. Tech.
ChEMBL_43688 (CHEMBL653666)
Ki
>1500±n/a nM
Citation
 Harbeson, SLAbelleira, SMAkiyama, ABarrett, RCarroll, RMStraub, JATkacz, JNWu, CMusso, GF Stereospecific synthesis of peptidyl alpha-keto amides as inhibitors of calpain. J Med Chem 37:2918-29 (1994)  
Target
Name:
Calpain-1 catalytic subunit
Synonyms:
CAN1_HUMAN CAPN1 Calpain-1 (u-Calpain) Calpain1
Type:
Protein
Mol. Mass.:
81880.51
Organism:
Homo sapiens (Human)
Description:
Residue:
714
  
Inhibitor
Name:
BDBM50040006
Synonyms:
CHEMBL101784 | [(S)-1-((R)-1-Ethylcarbamoyl-2-phenyl-ethylcarbamoyl)-3-methyl-butyl]-carbamic acid benzyl ester
Type:
Small organic molecule
Emp. Form.:
C25H33N3O4
Mol. Mass.:
439.5472
SMILES:
CCNC(=O)[C@@H](Cc1ccccc1)NC(=O)[C@H](CC(C)C)NC(=O)OCc1ccccc1
: