Target
D(2) dopamine receptor
Ligand
BDBM50040158
Substrate
Meas. Tech.
ChEMBL_61609 (CHEMBL672906)
IC50
>1000±n/a nM
Citation
 Lin, CHHaadsma-Svensson, SRLahti, RAMcCall, RBPiercey, MFSchreur, PJVon Voigtlander, PFSmith, MWChidester, CG Centrally acting serotonergic and dopaminergic agents. 1. Synthesis and structure-activity relationships of 2,3,3a,4,5,9b-hexahydro-1H-benz[e]indole derivatives. J Med Chem 36:1053-68 (1993)  
Target
Name:
D(2) dopamine receptor
Synonyms:
DOPAMINE D2 DOPAMINE D2 Short Dopamine D2 receptor Drd2
Type:
G Protein-Coupled Receptor (GPCR)
Mol. Mass.:
50931.60
Organism:
Rattus norvegicus (rat)
Description:
P61169
Residue:
444
  
Inhibitor
Name:
BDBM50040158
Synonyms:
9-Methoxy-2-methyl-3-propyl-2,3,3a,4,5,9b-hexahydro-1H-benzo[e]indole | CHEMBL10561
Type:
Small organic molecule
Emp. Form.:
C17H25NO
Mol. Mass.:
259.3865
SMILES:
CCCN1[C@H](C)CC2[C@H]1CCc1cccc(OC)c21
: