Target
cGMP-specific 3',5'-cyclic phosphodiesterase
Ligand
BDBM50040348
Substrate
Meas. Tech.
ChEMBL_155377 (CHEMBL760830)
IC50
71000±n/a nM
Citation
 Buckle, DRArch, JRConnolly, BJFenwick, AEFoster, KAMurray, KJReadshaw, SASmallridge, MSmith, DG Inhibition of cyclic nucleotide phosphodiesterase by derivatives of 1,3-bis(cyclopropylmethyl)xanthine. J Med Chem 37:476-85 (1994)  
Target
Name:
cGMP-specific 3',5'-cyclic phosphodiesterase
Synonyms:
3',5'-cyclic phosphodiesterase PDE5 PDE5A_HUMAN Phosphodiesterase 5 (PDE5) Phosphodiesterase 5A (PDE5A) cGMP-specific 3',5'-cyclic phosphodiesterase
Type:
Protein
Mol. Mass.:
99975.83
Organism:
Homo sapiens (Human)
Description:
O76074
Residue:
875
  
Inhibitor
Name:
BDBM50040348
Synonyms:
8-Amino-1,3-bis-cyclopropylmethyl-3,7-dihydro-purine-2,6-dione CHEMBL356323
Type:
Small organic molecule
Emp. Form.:
C13H17N5O2
Mol. Mass.:
275.3064
SMILES:
Nc1nc2n(CC3CC3)c(=O)n(CC3CC3)c(=O)c2[nH]1
: