Target
Glutamate receptor ionotropic, NMDA 1
Ligand
BDBM50038171
Substrate
Meas. Tech.
ChEMBL_140307 (CHEMBL749365)
IC50
1.4±n/a nM
Citation
 Kulagowski, JJBaker, RCurtis, NRLeeson, PDMawer, IMMoseley, AMRidgill, MPRowley, MStansfield, IFoster, AC 3'-(Arylmethyl)- and 3'-(aryloxy)-3-phenyl-4-hydroxyquinolin-2(1H)-ones: orally active antagonists of the glycine site on the NMDA receptor. J Med Chem 37:1402-5 (1994)  
Target
Name:
Glutamate receptor ionotropic, NMDA 1
Synonyms:
Glutamate (NMDA) receptor subunit zeta 1 Glutamate-NMDA-Channel Glutamate-NMDA-Polyamine NMDA Nmdar1 | phencyclidine
Type:
Enzyme Catalytic Domain
Mol. Mass.:
105533.40
Organism:
RAT
Description:
P35439
Residue:
938
  
Inhibitor
Name:
BDBM50038171
Synonyms:
7-Chloro-4-hydroxy-3-[3-(thiophen-3-yloxy)-phenyl]-1H-quinolin-2-one | CHEMBL32076
Type:
Small organic molecule
Emp. Form.:
C19H12ClNO3S
Mol. Mass.:
369.821
SMILES:
Oc1c(-c2cccc(Oc3ccsc3)c2)c(=O)[nH]c2cc(Cl)ccc12
: