Target
Sodium-dependent serotonin transporter
Ligand
BDBM25870
Substrate
Meas. Tech.
ChEMBL_1280677 (CHEMBL3097310)
IC50
3.0±n/a nM
Citation
 Pessoa-Mahana, HGonzález-Lira, CFierro, AZapata-Torres, GPessoa-Mahana, CDOrtiz-Severin, JIturriaga-Vásquez, PReyes-Parada, MSilva-Matus, PSaitz-Barría, CAraya-Maturana, R Synthesis, docking and pharmacological evaluation of novel homo- and hetero-bis 3-piperazinylpropylindole derivatives at SERT and 5-HT1A receptor. Bioorg Med Chem 21:7604-11 (2013)  
Target
Name:
Sodium-dependent serotonin transporter
Synonyms:
5-HT Transporter 5HT transporter Anandamid membrane transporter, AMT Monoamine transporters; Norepinephrine & serotonin Slc6a4 Sodium-dependent serotonin transporter (SERT) | imipramine receptor
Type:
Multi-pass membrane protein
Mol. Mass.:
70168.43
Organism:
Rattus norvegicus (rat)
Description:
P31652
Residue:
630
  
Inhibitor
Name:
BDBM25870
Synonyms:
1-[3-(dimethylamino)propyl]-1-(4-fluorophenyl)-1,3-dihydro-2-benzofuran-5-carbonitrile CITALOPRAM Escitalopram [3H]Cytalopram [3H]Lexapro
Type:
radiolabeled ligand
Emp. Form.:
C20H21FN2O
Mol. Mass.:
324.3919
SMILES:
CN(C)CCCC1(OCc2cc(ccc12)C#N)c1ccc(F)cc1
: