Target
Endothelin-1 receptor
Ligand
BDBM50041618
Substrate
Meas. Tech.
ChEMBL_65650 (CHEMBL678070)
Ki
43±n/a nM
Citation
 Elliott, JDLago, MACousins, RDGao, ALeber, JDErhard, KFNambi, PElshourbagy, NAKumar, CLee, JA 1,3-Diarylindan-2-carboxylic acids, potent and selective non-peptide endothelin receptor antagonists. J Med Chem 37:1553-7 (1994)  
Target
Name:
Endothelin-1 receptor
Synonyms:
EDNRA ET-A ETA-R Endothelin receptor type A hET-AR
Type:
Enzyme Catalytic Domain
Mol. Mass.:
48736.88
Organism:
Homo sapiens (Human)
Description:
P25101
Residue:
427
  
Inhibitor
Name:
BDBM50041618
Synonyms:
(1R,2R,3S)-1-Benzo[1,3]dioxol-5-yl-3-(4-methoxy-phenyl)-indan-2-carboxylic acid | CHEMBL38537
Type:
Small organic molecule
Emp. Form.:
C24H20O5
Mol. Mass.:
388.4126
SMILES:
COc1ccc(cc1)[C@@H]1[C@H]([C@@H](c2ccccc12)c1ccc2OCOc2c1)C(O)=O
: