Target
Adenosine receptor A1
Ligand
BDBM82021
Substrate
Meas. Tech.
ChEBML_29009
Ki
3700±n/a nM
Citation
 Müller, CEShi, DManning, MDaly, JW Synthesis of paraxanthine analogs (1,7-disubstituted xanthines) and other xanthines unsubstituted at the 3-position: structure-activity relationships at adenosine receptors. J Med Chem 36:3341-9 (1993)  
Target
Name:
Adenosine receptor A1
Synonyms:
AA1R_RAT ADENOSINE A1 high Adenosine A1 receptor (A1) Adenosine receptors A1 | Adora1
Type:
Protein
Mol. Mass.:
36704.13
Organism:
Rattus norvegicus (rat)
Description:
Residue:
326
  
Inhibitor
Name:
BDBM82021
Synonyms:
1,3-Diethylxanthine CHEMBL416013 | NSC_101420
Type:
Small organic molecule
Emp. Form.:
C9H12N4O2
Mol. Mass.:
208.2172
SMILES:
CCn1c2nc[nH]c2c(=O)n(CC)c1=O
: