Target
Type-1 angiotensin II receptor B
Ligand
BDBM50042232
Substrate
Meas. Tech.
ChEBML_34806
IC50
60±n/a nM
Citation
 Bernhart, CAPerreaut, PMFerrari, BPMuneaux, YAAssens, JLClément, JHaudricourt, FMuneaux, CFTaillades, JEVignal, MA A new series of imidazolones: highly specific and potent nonpeptide AT1 angiotensin II receptor antagonists. J Med Chem 36:3371-80 (1993)  
Target
Name:
Type-1 angiotensin II receptor B
Synonyms:
AGTRB_RAT Agtr1 Angiotensin II AT1B Angiotensin II type 1b (AT-1b) receptor Type-1B angiotensin II receptor
Type:
Enzyme Catalytic Domain
Mol. Mass.:
40929.44
Organism:
RAT
Description:
Angiotensin II AT1B 0 RAT::P29089
Residue:
359
  
Inhibitor
Name:
BDBM50042232
Synonyms:
2-{4-[2-butyl-5-oxospiro[4,5-dihydro-1H-imidazole-4,2'-(2',3'-dihydro-1'H-indene)]-1-ylmethyl]phenyl}benzoic acid | CHEMBL114983
Type:
Small organic molecule
Emp. Form.:
C29H28N2O3
Mol. Mass.:
452.5442
SMILES:
CCCCC1=NC2(Cc3ccccc3C2)C(=O)N1Cc1ccc(cc1)-c1ccccc1C(O)=O
: