Target
Type-2 angiotensin II receptor
Ligand
BDBM50043041
Substrate
Meas. Tech.
ChEBML_35286
IC50
90±n/a nM
Citation
 VanAtten, MKEnsinger, CLChiu, ATMcCall, DENguyen, TTWexler, RRTimmermans, PB A novel series of selective, non-peptide inhibitors of angiotensin II binding to the AT2 site. J Med Chem 36:3985-92 (1994)  
Target
Name:
Type-2 angiotensin II receptor
Synonyms:
AGTR2_RAT Agtr2 Angiotensin II receptor Type-2 angiotensin II receptor
Type:
Enzyme Catalytic Domain
Mol. Mass.:
41346.62
Organism:
RAT
Description:
Angiotensin II AT2 0 0::P35351
Residue:
363
  
Inhibitor
Name:
BDBM50043041
Synonyms:
2-Diphenylacetyl-5-(4-methoxy-benzyl)-1,2,3,4-tetrahydro-isoquinoline-3-carboxylic acid | CHEMBL339485
Type:
Small organic molecule
Emp. Form.:
C32H29NO4
Mol. Mass.:
491.577
SMILES:
COc1ccc(Cc2cccc3CN(C(Cc23)C(O)=O)C(=O)C(c2ccccc2)c2ccccc2)cc1
: