Target
Type-2 angiotensin II receptor
Ligand
BDBM50043032
Substrate
Meas. Tech.
ChEMBL_35286 (CHEMBL647850)
IC50
80.0±n/a nM
Citation
 VanAtten, MKEnsinger, CLChiu, ATMcCall, DENguyen, TTWexler, RRTimmermans, PB A novel series of selective, non-peptide inhibitors of angiotensin II binding to the AT2 site. J Med Chem 36:3985-92 (1994)  
Target
Name:
Type-2 angiotensin II receptor
Synonyms:
AGTR2_RAT Agtr2 Angiotensin II receptor Type-2 angiotensin II receptor
Type:
Enzyme Catalytic Domain
Mol. Mass.:
41346.62
Organism:
RAT
Description:
Angiotensin II AT2 0 0::P35351
Residue:
363
  
Inhibitor
Name:
BDBM50043032
Synonyms:
5-Benzyl-2-diphenylacetyl-1,2,3,4-tetrahydro-isoquinoline-3-carboxylic acid | CHEMBL340902
Type:
Small organic molecule
Emp. Form.:
C31H27NO3
Mol. Mass.:
461.551
SMILES:
OC(=O)C1Cc2c(Cc3ccccc3)cccc2CN1C(=O)C(c1ccccc1)c1ccccc1
: