Target
5-lipoxygenase
Ligand
BDBM50043358
Substrate
Meas. Tech.
ChEMBL_3983 (CHEMBL619256)
IC50
3000±n/a nM
Citation
 Müller, KGürster, DPiwek, SWiegrebe, W Antipsoriatic anthrones with modulated redox properties. 1. Novel 10-substituted 1,8-dihydroxy-9(10H)-anthracenones as inhibitors of 5-lipoxygenase. J Med Chem 36:4099-107 (1994)  
Target
Name:
5-lipoxygenase
Synonyms:
Arachidonate 5-lipoxygenase
Type:
PROTEIN
Mol. Mass.:
49994.23
Organism:
Bos taurus
Description:
ChEMBL_157766
Residue:
430
  
Inhibitor
Name:
BDBM50043358
Synonyms:
(E)-1,8-Dihydroxy-10-[3-(3-methoxy-phenyl)-acryloyl]-10H-anthracen-9-one | CHEMBL433846
Type:
Small organic molecule
Emp. Form.:
C24H18O5
Mol. Mass.:
386.3967
SMILES:
COc1cccc(C=CC(=O)C2c3cccc(O)c3C(=O)c3c(O)cccc23)c1
: