Target
3-oxo-5-alpha-steroid 4-dehydrogenase 1
Ligand
BDBM50043606
Substrate
Meas. Tech.
ChEMBL_88441 (CHEMBL701910)
Ki
720±n/a nM
Citation
 Frye, SVHaffner, CDMaloney, PRMook, RADorsey, GFHiner, RNBatchelor, KWBramson, HNStuart, JDSchweiker, SL 6-Azasteroids: potent dual inhibitors of human type 1 and 2 steroid 5 alpha-reductase. J Med Chem 36:4313-5 (1994)  
Target
Name:
3-oxo-5-alpha-steroid 4-dehydrogenase 1
Synonyms:
3-oxo-5-alpha-steroid 4-dehydrogenase 1 S5A1_HUMAN SR type 1 Steroid 5-alpha-reductase | Steroid 5-alpha-reductase 1
Type:
Enzyme
Mol. Mass.:
29472.80
Organism:
Homo sapiens (Human)
Description:
P18405
Residue:
259
  
Inhibitor
Name:
BDBM50043606
Synonyms:
9a,11a-Dimethyl-7-oxo-2,3,3a,3b,4,5,7,8,9,9a,9b,10,11,11a-tetradecahydro-1H-cyclopenta[i]phenanthridine-1-carboxylic acid ethyl-methyl-amide | CHEMBL136863
Type:
Small organic molecule
Emp. Form.:
C22H34N2O2
Mol. Mass.:
358.5176
SMILES:
CCN(C)C(=O)[C@H]1CCC2C3CN=C4CC(=O)CC[C@]4(C)C3CC[C@]12C
: