Target
3-oxo-5-alpha-steroid 4-dehydrogenase 2
Ligand
BDBM50039298
Substrate
Meas. Tech.
ChEMBL_88442 (CHEMBL873205)
IC50
0.09±n/a nM
Citation
 Frye, SVHaffner, CDMaloney, PRMook, RADorsey, GFHiner, RNBatchelor, KWBramson, HNStuart, JDSchweiker, SL 6-Azasteroids: potent dual inhibitors of human type 1 and 2 steroid 5 alpha-reductase. J Med Chem 36:4313-5 (1994)  
Target
Name:
3-oxo-5-alpha-steroid 4-dehydrogenase 2
Synonyms:
3-oxo-5-alpha-steroid 4-dehydrogenase 2 5α-Reductase 2 (5α-R2) SR type 2 Steroid 5-alpha-reductase Type II 5-alpha reductase
Type:
Enzyme
Mol. Mass.:
28406.59
Organism:
Homo sapiens (Human)
Description:
P31213
Residue:
254
  
Inhibitor
Name:
BDBM50039298
Synonyms:
(1S,9aR,11aS)-9a,11a-Dimethyl-7-oxo-2,3,3a,3b,4,5,7,8,9,9a,9b,10,11,11a-tetradecahydro-1H-cyclopenta[i]phenanthridine-1-carboxylic acid benzhydryl-amide CHEMBL24088
Type:
Small organic molecule
Emp. Form.:
C32H38N2O2
Mol. Mass.:
482.6563
SMILES:
C[C@]12CCC3C(CN=C4CC(=O)CC[C@]34C)C1CC[C@@H]2C(=O)NC(c1ccccc1)c1ccccc1
: