Target
Endothelin-1 receptor
Ligand
BDBM50034452
Substrate
Meas. Tech.
ChEMBL_65826 (CHEMBL877809)
IC50
780.0±n/a nM
Citation
 Stein, PDHunt, JTFloyd, DMMoreland, SDickinson, KEMitchell, CLiu, ECWebb, MLMurugesan, NDickey, J The discovery of sulfonamide endothelin antagonists and the development of the orally active ETA antagonist 5-(dimethylamino)-N-(3,4-dimethyl-5-isoxazolyl)-1-naphthalenesulf onamide. J Med Chem 37:329-31 (1994)  
Target
Name:
Endothelin-1 receptor
Synonyms:
EDNRA ET-A ETA-R Endothelin receptor type A hET-AR
Type:
Enzyme Catalytic Domain
Mol. Mass.:
48736.88
Organism:
Homo sapiens (Human)
Description:
P25101
Residue:
427
  
Inhibitor
Name:
BDBM50034452
Synonyms:
4-Amino-N-(3,4-dimethyl-isoxazol-5-yl)-benzenesulfonamide Eryzole Pediazole Sosol Sulfafurazole Sulfisoxazol Sulsoxin
Type:
Small organic molecule
Emp. Form.:
C11H13N3O3S
Mol. Mass.:
267.304
SMILES:
Cc1noc(NS(=O)(=O)c2ccc(N)cc2)c1C
: