Target
Endothelin-1 receptor
Ligand
BDBM50034446
Substrate
Meas. Tech.
ChEMBL_65826 (CHEMBL877809)
IC50
20000±n/a nM
Citation
 Stein, PDHunt, JTFloyd, DMMoreland, SDickinson, KEMitchell, CLiu, ECWebb, MLMurugesan, NDickey, J The discovery of sulfonamide endothelin antagonists and the development of the orally active ETA antagonist 5-(dimethylamino)-N-(3,4-dimethyl-5-isoxazolyl)-1-naphthalenesulf onamide. J Med Chem 37:329-31 (1994)  
Target
Name:
Endothelin-1 receptor
Synonyms:
EDNRA ET-A ETA-R Endothelin receptor type A hET-AR
Type:
Enzyme Catalytic Domain
Mol. Mass.:
48736.88
Organism:
Homo sapiens (Human)
Description:
P25101
Residue:
427
  
Inhibitor
Name:
BDBM50034446
Synonyms:
CHEMBL27065 | Naphthalene-1-sulfonic acid (3,4-dimethyl-isoxazol-5-yl)-amide
Type:
Small organic molecule
Emp. Form.:
C15H14N2O3S
Mol. Mass.:
302.348
SMILES:
Cc1noc(NS(=O)(=O)c2cccc3ccccc23)c1C
: