Target
Polyphenol oxidase 2
Ligand
BDBM50241361
Substrate
Meas. Tech.
ChEMBL_1351427 (CHEMBL3267003)
Ki
470000±n/a nM
Citation
 Chan, CFLai, STGuo, YCChen, MJ Inhibitory effects of novel synthetic methimazole derivatives on mushroom tyrosinase and melanogenesis. Bioorg Med Chem 22:2809-15 (2014)  
Target
Name:
Polyphenol oxidase 2
Synonyms:
Monophenol monooxygenase PPO2 Tyrosinase
Type:
Protein
Mol. Mass.:
63923.66
Organism:
Agaricus bisporus (Common mushroom)
Description:
O42713
Residue:
556
  
Inhibitor
Name:
BDBM50241361
Synonyms:
CHEMBL1515 US9138393, Methimazole | US9144538, Methimazole
Type:
Small organic molecule
Emp. Form.:
C4H6N2S
Mol. Mass.:
114.169
SMILES:
Cn1cc[nH]c1=S
: