Target
Cathepsin D
Ligand
BDBM50045286
Substrate
Meas. Tech.
ChEBML_45168
Ki
>10000±n/a nM
Citation
 Rao, CMScarborough, PEKay, JBatley, BRapundalo, SKlutchko, STaylor, MDLunney, EAHumblet, CCDunn, BM Specificity in the binding of inhibitors to the active site of human/primate aspartic proteinases: analysis of P2-P1-P1'-P2' variation. J Med Chem 36:2614-20 (1993)  
Target
Name:
Cathepsin D
Synonyms:
CATD_HUMAN CTSD Cathepsin D heavy chain Cathepsin D precursor
Type:
Enzyme
Mol. Mass.:
44551.72
Organism:
Homo sapiens (Human)
Description:
Human proCathepsin D (SwissProt accession number P07339) was expressed in Sf9 cells, purified, and autoactivated.
Residue:
412
  
Inhibitor
Name:
BDBM50045286
Synonyms:
CHEMBL3348525 | N-[1-(1-Cyclohexylmethyl-2,4-dihydroxy-hexylcarbamoyl)-2-(4H-imidazol-4-yl)-ethyl]-2-(morpholine-4-sulfonylamino)-3-phenyl-propionamide
Type:
Small organic molecule
Emp. Form.:
C32H50N6O7S
Mol. Mass.:
662.84
SMILES:
CC[C@@H](O)C[C@H](O)[C@H](CC1CCCCC1)NC(=O)[C@H](Cc1c[nH]cn1)NC(=O)[C@H](Cc1ccccc1)NS(=O)(=O)N1CCOCC1
: