Target
Kappa-type opioid receptor
Ligand
BDBM50045759
Substrate
Meas. Tech.
ChEMBL_220932 (CHEMBL874095)
Ki
20±n/a nM
Citation
 Zimmerman, DMLeander, JDCantrell, BEReel, JKSnoddy, JMendelsohn, LGJohnson, BGMitch, CH Structure-activity relationships of trans-3,4-dimethyl-4-(3-hydroxyphenyl)piperidine antagonists for mu- and kappa-opioid receptors. J Med Chem 36:2833-41 (1993)  
Target
Name:
Kappa-type opioid receptor
Synonyms:
Kappa Opioid Receptor OPRK1 Opiate Kappa 1 | mu/kappa opioid receptor
Type:
G Protein-Coupled Receptor (GPCR)
Mol. Mass.:
42744.99
Organism:
Cavia porcellus (domestic guinea pig)
Description:
P41144
Residue:
380
  
Inhibitor
Name:
BDBM50045759
Synonyms:
3-[3,4-Dimethyl-1-(4-thiophen-2-yl-butyl)-piperidin-4-yl]-phenol | CHEMBL264797
Type:
Small organic molecule
Emp. Form.:
C21H29NOS
Mol. Mass.:
343.526
SMILES:
C[C@H]1CN(CCCCc2cccs2)CC[C@@]1(C)c1cccc(O)c1
: