Target
Mu-type opioid receptor
Ligand
BDBM50045783
Substrate
Meas. Tech.
ChEBML_220391
Ki
2.6±n/a nM
Citation
 Mitch, CHLeander, JDMendelsohn, LGShaw, WNWong, DTCantrell, BEJohnson, BGReel, JKSnoddy, JDTakemori, AE 3,4-Dimethyl-4-(3-hydroxyphenyl)piperidines: opioid antagonists with potent anorectant activity. J Med Chem 36:2842-50 (1993)  
Target
Name:
Mu-type opioid receptor
Synonyms:
MOR-1 Mu-type opioid receptor (MOR) OPRM_RAT Opioid receptor B Ror-b
Type:
G Protein-Coupled Receptor (GPCR)
Mol. Mass.:
44503.11
Organism:
Rattus norvegicus (rat)
Description:
Competition binding assays were carried out using membrane preparations from transfected HN9.10 cells that constitutively expressed the mu opioid receptor.
Residue:
398
  
Inhibitor
Name:
BDBM50045783
Synonyms:
3-[1-(3-Hydroxy-4-methyl-pentyl)-3,4-dimethyl-piperidin-4-yl]-phenol | CHEMBL94577
Type:
Small organic molecule
Emp. Form.:
C19H31NO2
Mol. Mass.:
305.4549
SMILES:
CC(C)C(O)CCN1CC[C@](C)([C@@H](C)C1)c1cccc(O)c1
: