Target
Platelet-activating factor receptor
Ligand
BDBM50003510
Substrate
Meas. Tech.
ChEBML_151691
IC50
21±n/a nM
Citation
 Carceller, EMerlos, MGiral, MAlmansa, CBartrolí, JGarcía-Rafanell, JForn, J Synthesis and structure-activity relationships of 1-acyl-4-((2-methyl-3-pyridyl)cyanomethyl)piperazines as PAF antagonists. J Med Chem 36:2984-97 (1993)  
Target
Name:
Platelet-activating factor receptor
Synonyms:
PAF-R PTAFR_CAVPO Platelet-activating factor receptor
Type:
Protein
Mol. Mass.:
39005.63
Organism:
Cavia porcellus
Description:
Residue:
342
  
Inhibitor
Name:
BDBM50003510
Synonyms:
CHEMBL103753 [4-(3-Hydroxy-3,3-diphenyl-propionyl)-piperazin-1-yl]-pyridin-3-yl-acetonitrile; hydrate
Type:
Small organic molecule
Emp. Form.:
C26H26N4O2
Mol. Mass.:
426.5102
SMILES:
OC(CC(=O)N1CCN(CC1)C(C#N)c1cccnc1)(c1ccccc1)c1ccccc1
: