Target
Platelet-activating factor receptor
Ligand
BDBM50003473
Substrate
Meas. Tech.
ChEBML_151691
IC50
10±n/a nM
Citation
 Carceller, EMerlos, MGiral, MAlmansa, CBartrolí, JGarcía-Rafanell, JForn, J Synthesis and structure-activity relationships of 1-acyl-4-((2-methyl-3-pyridyl)cyanomethyl)piperazines as PAF antagonists. J Med Chem 36:2984-97 (1993)  
Target
Name:
Platelet-activating factor receptor
Synonyms:
PAF-R PTAFR_CAVPO Platelet-activating factor receptor
Type:
Protein
Mol. Mass.:
39005.63
Organism:
Cavia porcellus
Description:
Residue:
342
  
Inhibitor
Name:
BDBM50003473
Synonyms:
CHEMBL317193 | [4-(3,3-Diphenyl-acryloyl)-piperazin-1-yl]-pyridin-3-yl-acetonitrile
Type:
Small organic molecule
Emp. Form.:
C26H24N4O
Mol. Mass.:
408.495
SMILES:
O=[#6](\[#6]=[#6](/c1ccccc1)-c1ccccc1)-[#7]-1-[#6]-[#6]-[#7](-[#6]-[#6]-1)-[#6](C#N)-c1cccnc1
: