Target
Platelet-activating factor receptor
Ligand
BDBM50045969
Substrate
Meas. Tech.
ChEMBL_151692 (CHEMBL760442)
IC50
41±n/a nM
Citation
 Carceller, EMerlos, MGiral, MAlmansa, CBartrolí, JGarcía-Rafanell, JForn, J Synthesis and structure-activity relationships of 1-acyl-4-((2-methyl-3-pyridyl)cyanomethyl)piperazines as PAF antagonists. J Med Chem 36:2984-97 (1993)  
Target
Name:
Platelet-activating factor receptor
Synonyms:
PAF-R PTAFR_CAVPO Platelet-activating factor receptor
Type:
Protein
Mol. Mass.:
39005.63
Organism:
Cavia porcellus
Description:
Residue:
342
  
Inhibitor
Name:
BDBM50045969
Synonyms:
CHEMBL103761 | [4-(3-Dibenzylamino-3-phenyl-propionyl)-piperazin-1-yl]-(2-methyl-pyridin-3-yl)-acetonitrile
Type:
Small organic molecule
Emp. Form.:
C35H37N5O
Mol. Mass.:
543.7012
SMILES:
Cc1ncccc1C(C#N)N1CCN(CC1)C(=O)CC(N(Cc1ccccc1)Cc1ccccc1)c1ccccc1
: