Target
Platelet-activating factor receptor
Ligand
BDBM50045976
Substrate
Meas. Tech.
ChEMBL_151692 (CHEMBL760442)
IC50
20±n/a nM
Citation
 Carceller, EMerlos, MGiral, MAlmansa, CBartrolí, JGarcía-Rafanell, JForn, J Synthesis and structure-activity relationships of 1-acyl-4-((2-methyl-3-pyridyl)cyanomethyl)piperazines as PAF antagonists. J Med Chem 36:2984-97 (1993)  
Target
Name:
Platelet-activating factor receptor
Synonyms:
PAF-R PTAFR_CAVPO Platelet-activating factor receptor
Type:
Protein
Mol. Mass.:
39005.63
Organism:
Cavia porcellus
Description:
Residue:
342
  
Inhibitor
Name:
BDBM50045976
Synonyms:
CHEMBL100809 | N-Benzhydryl-N-(2-{4-[cyano-(2-methyl-pyridin-3-yl)-methyl]-piperazin-1-yl}-2-oxo-ethyl)-acetamide
Type:
Small organic molecule
Emp. Form.:
C29H31N5O2
Mol. Mass.:
481.5887
SMILES:
CC(=O)N(CC(=O)N1CCN(CC1)C(C#N)c1cccnc1C)C(c1ccccc1)c1ccccc1
: