Target
Prothrombin
Ligand
BDBM50046345
Substrate
Meas. Tech.
ChEMBL_207947 (CHEMBL811063)
EC50
50±n/a nM
Citation
 Balasubramanian, NSt Laurent, DRFederici, MEMeanwell, NAWright, JJSchumacher, WASeiler, SM Active site-directed synthetic thrombin inhibitors: synthesis, in vitro and in vivo activity profile of BMY 44621 and analogs. An examination of the role of the amino group in the D-Phe-Pro-Arg-H series. J Med Chem 36:300-3 (1993)  
Target
Name:
Prothrombin
Synonyms:
Activation peptide fragment 1 Coagulation factor II Prothrombin precursor Thrombin heavy chain | Thrombin light chain
Type:
Protein
Mol. Mass.:
70029.57
Organism:
Homo sapiens (Human)
Description:
P00734
Residue:
622
  
Inhibitor
Name:
BDBM50046345
Synonyms:
2-{[2-(1-Formyl-4-guanidino-butylcarbamoyl)-pyrrolidine-1-carbonyl]-amino}-3-phenyl-propionic acid | CHEMBL319396
Type:
Small organic molecule
Emp. Form.:
C21H30N6O5
Mol. Mass.:
446.5001
SMILES:
NC(=N)NCCCC(NC(=O)C1CCCN1C(=O)N[C@H](Cc1ccccc1)C(O)=O)C=O
: