Target
Gag-Pol polyprotein [489-587]
Ligand
BDBM50046376
Substrate
Meas. Tech.
ChEMBL_159311 (CHEMBL769364)
IC50
38±n/a nM
Citation
 Kempf, DJCodacovi, LWang, XCKohlbrenner, WEWideburg, NESaldivar, AVasavanonda, SMarsh, KCBryant, PSham, HL Symmetry-based inhibitors of HIV protease. Structure-activity studies of acylated 2,4-diamino-1,5-diphenyl-3-hydroxypentane and 2,5-diamino-1,6-diphenylhexane-3,4-diol. J Med Chem 36:320-30 (1993)  
Target
Name:
Gag-Pol polyprotein [489-587]
Synonyms:
Human immunodeficiency virus type 1 protease Pol polyprotein | gag-pol
Type:
Enzyme Subunit
Mol. Mass.:
10781.16
Organism:
Human immunodeficiency virus type 1
Description:
P04585[489-587]
Residue:
99
  
Inhibitor
Name:
BDBM50046376
Synonyms:
1N-[1-benzyl-2,3-dihydroxy-4-[2-methyl-1-methyl(2-pyridylmethyl)aminosulfomoyl-(1R)-propylcarboxamido]-5-phenyl-(1S,2S,3R,4S)-pentyl]-3-methyl-2-methyl(2-pyridylmethyl)aminosulfomoyl-(2S)-butanamide | CHEMBL325731
Type:
Small organic molecule
Emp. Form.:
C42H58N8O8S2
Mol. Mass.:
867.089
SMILES:
CC(C)[C@H](NS(=O)(=O)N(C)Cc1ccccn1)C(=O)N[C@@H](Cc1ccccc1)[C@H](O)[C@H](O)[C@H](Cc1ccccc1)NC(=O)[C@H](NS(=O)(=O)N(C)Cc1ccccn1)C(C)C
: