Target
Gag-Pol polyprotein [489-587]
Ligand
BDBM50046415
Substrate
Meas. Tech.
ChEMBL_159311 (CHEMBL769364)
IC50
24±n/a nM
Citation
 Kempf, DJCodacovi, LWang, XCKohlbrenner, WEWideburg, NESaldivar, AVasavanonda, SMarsh, KCBryant, PSham, HL Symmetry-based inhibitors of HIV protease. Structure-activity studies of acylated 2,4-diamino-1,5-diphenyl-3-hydroxypentane and 2,5-diamino-1,6-diphenylhexane-3,4-diol. J Med Chem 36:320-30 (1993)  
Target
Name:
Gag-Pol polyprotein [489-587]
Synonyms:
Human immunodeficiency virus type 1 protease Pol polyprotein | gag-pol
Type:
Enzyme Subunit
Mol. Mass.:
10781.16
Organism:
Human immunodeficiency virus type 1
Description:
P04585[489-587]
Residue:
99
  
Inhibitor
Name:
BDBM50046415
Synonyms:
CHEMBL322939 | N-{1-Benzyl-2,3-dihydroxy-4-[3-methyl-2-(2-pyridin-4-yl-ethanesulfonylamino)-butyrylamino]-5-phenyl-pentyl}-3-methyl-2-(2-pyridin-4-yl-ethanesulfonylamino)-butyramide
Type:
Small organic molecule
Emp. Form.:
C42H56N6O8S2
Mol. Mass.:
837.059
SMILES:
CC(C)[C@H](NS(=O)(=O)CCc1ccncc1)C(=O)N[C@@H](Cc1ccccc1)[C@@H](O)[C@H](O)[C@H](Cc1ccccc1)NC(=O)[C@H](NS(=O)(=O)CCc1ccncc1)C(C)C
: