Target
Nuclear factor erythroid 2-related factor 2
Ligand
BDBM50498216
Substrate
Meas. Tech.
ChEMBL_1474110 (CHEMBL3424043)
IC50
750±n/a nM
Citation
 Richardson, BGJain, ADSpeltz, TEMoore, TW Non-electrophilic modulators of the canonical Keap1/Nrf2 pathway. Bioorg Med Chem Lett 25:2261-8 (2015)  
Target
Name:
Nuclear factor erythroid 2-related factor 2
Synonyms:
HEBP1 NF-E2-related factor 2 NFE2-related factor 2 NRF2 Nuclear factor, erythroid derived 2, like 2
Type:
PROTEIN
Mol. Mass.:
67786.89
Organism:
Homo sapiens (Human)
Description:
ChEMBL_107924
Residue:
605
  
Inhibitor
Name:
BDBM50498216
Synonyms:
CHEMBL3422852
Type:
Small organic molecule
Emp. Form.:
C27H30N2O4
Mol. Mass.:
446.5381
SMILES:
Cc1cccc2[C@@H](CN3Cc4ccccc4C3=O)N(CCc12)C(=O)[C@H]1CCCC[C@H]1C(O)=O
: