Target
Adenosine receptor A1
Ligand
BDBM10850
Substrate
Meas. Tech.
ChEBML_29287
Ki
180000±n/a nM
Citation
 Miyamoto, KYamamoto, YKurita, MSakai, RKonno, KSanae, FOhshima, TTakagi, KHasegawa, TIwasaki, N Bronchodilator activity of xanthine derivatives substituted with functional groups at the 1- or 7-position. J Med Chem 36:1380-6 (1993)  
Target
Name:
Adenosine receptor A1
Synonyms:
A1 adenosine receptor ADENOSINE A1 ADENOSINE A1 low Adenosine A1 receptor | Adenosine Receptor A1
Type:
Enzyme Catalytic Domain
Mol. Mass.:
36501.39
Organism:
GUINEA PIG
Description:
ADENOSINE A1 ADORA1 GUINEA PIG::P47745
Residue:
326
  
Inhibitor
Name:
BDBM10850
Synonyms:
1-(5-Oxohexyl)theobromine (pentoxifylline) 3,7-dimethyl-1-(5-oxohexyl)-3,7-dihydropurine-2,6-dione Pentoxifylline Pentoxyphylline
Type:
Small organic molecule
Emp. Form.:
C13H18N4O3
Mol. Mass.:
278.307
SMILES:
CC(=O)CCCCn1c(=O)n(C)c2ncn(C)c2c1=O
: